Reaction Details
TargetThreonine--tRNA ligase
LigandBDBM50426182
Substrate/Competitorn/a
Meas. Tech.ChEMBL_935847 (CHEMBL2317883)
Ki 1.8±n/a nM
Citation Teng, MHilgers, MTCunningham, MLBorchardt, ALocke, JBAbraham, SHaley, GKwan, BPHall, CHough, GWShaw, KJFinn, J Identification of bacteria-selective threonyl-tRNA synthetase substrate inhibitors by structure-based design. J Med Chem56:1748-60 (2013) 
 
Threonine--tRNA ligase
Name:Threonine--tRNA ligase
Type:PROTEIN
Mol. Mass.:73649.43
Organism:Yersinia pestis
Description:ChEMBL_935847
Residue:642
BDBM50426182
NameBDBM50426182
Synonyms:CHEMBL2311926
TypeSmall organic molecule
Emp. Form.C20H19N5O4S
Mol. Mass.425.461
SMILESC[C@@H](O)[C@H](N)C(=O)NS(=O)(=O)c1ccc2ccc(cc2c1)-c1ncnc2[nH]ccc12