Reaction Details
TargetThreonine--tRNA ligase
LigandBDBM50426193
Substrate/Competitorn/a
Meas. Tech.ChEMBL_935847 (CHEMBL2317883)
Ki 23±n/a nM
Citation Teng, MHilgers, MTCunningham, MLBorchardt, ALocke, JBAbraham, SHaley, GKwan, BPHall, CHough, GWShaw, KJFinn, J Identification of bacteria-selective threonyl-tRNA synthetase substrate inhibitors by structure-based design. J Med Chem56:1748-60 (2013) 
 
Threonine--tRNA ligase
Name:Threonine--tRNA ligase
Type:PROTEIN
Mol. Mass.:73649.43
Organism:Yersinia pestis
Description:ChEMBL_935847
Residue:642
BDBM50426193
NameBDBM50426193
Synonyms:CHEMBL2316967
TypeSmall organic molecule
Emp. Form.C18H23N5O4S
Mol. Mass.405.471
SMILESCC(C)[C@@H](O)[C@H](N)C(=O)NS(=O)(=O)\C=C\c1cccc(c1)-c1cc(N)ncn1