Reaction Details
TargetThreonine--tRNA ligase
LigandBDBM50426194
Substrate/Competitorn/a
Meas. Tech.ChEMBL_935847 (CHEMBL2317883)
Ki 2.7±n/a nM
Citation Teng, MHilgers, MTCunningham, MLBorchardt, ALocke, JBAbraham, SHaley, GKwan, BPHall, CHough, GWShaw, KJFinn, J Identification of bacteria-selective threonyl-tRNA synthetase substrate inhibitors by structure-based design. J Med Chem56:1748-60 (2013) 
 
Threonine--tRNA ligase
Name:Threonine--tRNA ligase
Type:PROTEIN
Mol. Mass.:73649.43
Organism:Yersinia pestis
Description:ChEMBL_935847
Residue:642
BDBM50426194
NameBDBM50426194
Synonyms:CHEMBL2316966
TypeSmall organic molecule
Emp. Form.C17H21N5O4S
Mol. Mass.391.445
SMILESCC[C@@H](O)[C@H](N)C(=O)NS(=O)(=O)\C=C\c1cccc(c1)-c1cc(N)ncn1