Reaction Details
TargetProstaglandin E synthase
LigandBDBM50426967
Substrate/Competitorn/a
Meas. Tech.ChEMBL_939016 (CHEMBL2328718)
IC50 3.0±n/a nM
Citation Walker, DPArhancet, GBLu, HFHeasley, SEMetz, SKablaoui, NMFranco, FMHanau, CEScholten, JASpringer, JRFobian, YMCarter, JSXing, LYang, SShaffer, AFJerome, GMBaratta, MTMoore, WMVazquez, ML Synthesis and biological evaluation of substituted benzoxazoles as inhibitors of mPGES-1: use of a conformation-based hypothesis to facilitate compound design. Bioorg Med Chem Lett23:1120-6 (2013) 
 
Prostaglandin E synthase
Name:Prostaglandin E synthase
Type:Protein
Mol. Mass.:17112.22
Organism:Homo sapiens (Human)
Description:n/a
Residue:152
BDBM50426967
NameBDBM50426967
Synonyms:CHEMBL2325079 | PF-4693627
TypeSmall organic molecule
Emp. Form.C26H29Cl2N3O3
Mol. Mass.502.433
SMILESOC[C@H]1CCC[C@@H](C1)NC(=O)C1CCN(CC1)c1nc2cc(Cl)c(cc2o1)-c1ccc(Cl)cc1