Reaction Details
TargetRAC-beta serine/threonine-protein kinase
LigandBDBM50427342
Substrate/Competitorn/a
Meas. Tech.ChEMBL_941088 (CHEMBL2330885)
IC50 709±n/a nM
Citation Addie, MBallard, PButtar, DCrafter, CCurrie, GDavies, BRDebreczeni, JDry, HDudley, PGreenwood, RJohnson, PDKettle, JGLane, CLamont, GLeach, ALuke, RWMorris, JOgilvie, DPage, KPass, MPearson, SRuston, L Discovery of 4-amino-N-[(1S)-1-(4-chlorophenyl)-3-hydroxypropyl]-1-(7H-pyrrolo[2,3-d]pyrimidin-4-yl)piperidine-4-carboxamide (AZD5363), an orally bioavailable, potent inhibitor of Akt kinases. J Med Chem56:2059-73 (2013) 
 
RAC-beta serine/threonine-protein kinase
Name:RAC-beta serine/threonine-protein kinase
Type:Enzyme
Mol. Mass.:55766.64
Organism:Homo sapiens (Human)
Description:n/a
Residue:481
BDBM50427342
NameBDBM50427342
Synonyms:CHEMBL2325986 US11236095, Example 46 | US9492453, 46
TypeSmall organic molecule
Emp. Form.C20H24N6O
Mol. Mass.364.4442
SMILESCC(NC(=O)C1(N)CCN(CC1)c1ncnc2[nH]ccc12)c1ccccc1