Reaction Details
TargetRAC-beta serine/threonine-protein kinase
LigandBDBM50427344
Substrate/Competitorn/a
Meas. Tech.ChEMBL_941088 (CHEMBL2330885)
IC50 210±n/a nM
Citation Addie, MBallard, PButtar, DCrafter, CCurrie, GDavies, BRDebreczeni, JDry, HDudley, PGreenwood, RJohnson, PDKettle, JGLane, CLamont, GLeach, ALuke, RWMorris, JOgilvie, DPage, KPass, MPearson, SRuston, L Discovery of 4-amino-N-[(1S)-1-(4-chlorophenyl)-3-hydroxypropyl]-1-(7H-pyrrolo[2,3-d]pyrimidin-4-yl)piperidine-4-carboxamide (AZD5363), an orally bioavailable, potent inhibitor of Akt kinases. J Med Chem56:2059-73 (2013) 
 
RAC-beta serine/threonine-protein kinase
Name:RAC-beta serine/threonine-protein kinase
Type:Enzyme
Mol. Mass.:55766.64
Organism:Homo sapiens (Human)
Description:n/a
Residue:481
BDBM50427344
NameBDBM50427344
Synonyms:CHEMBL2325984 US11236095, Example 29 | US9492453, 29
TypeSmall organic molecule
Emp. Form.C25H25ClN6O
Mol. Mass.460.959
SMILESNC1(CCN(CC1)c1ncnc2[nH]ccc12)C(=O)NC(c1ccccc1)c1ccc(Cl)cc1