Reaction Details
TargetRAC-alpha serine/threonine-protein kinase
LigandBDBM50427361
Substrate/Competitorn/a
Meas. Tech.ChEMBL_941089 (CHEMBL2330886)
IC50 3.0±n/a nM
Citation Addie, MBallard, PButtar, DCrafter, CCurrie, GDavies, BRDebreczeni, JDry, HDudley, PGreenwood, RJohnson, PDKettle, JGLane, CLamont, GLeach, ALuke, RWMorris, JOgilvie, DPage, KPass, MPearson, SRuston, L Discovery of 4-amino-N-[(1S)-1-(4-chlorophenyl)-3-hydroxypropyl]-1-(7H-pyrrolo[2,3-d]pyrimidin-4-yl)piperidine-4-carboxamide (AZD5363), an orally bioavailable, potent inhibitor of Akt kinases. J Med Chem56:2059-73 (2013) 
 
RAC-alpha serine/threonine-protein kinase
Name:RAC-alpha serine/threonine-protein kinase
Type:Enzyme
Mol. Mass.:55681.25
Organism:Homo sapiens (Human)
Description:P31749
Residue:480
BDBM50427361
NameBDBM50427361
Synonyms:CHEMBL2325727 US11236095, Example 11B | US9492453, 11A
TypeSmall organic molecule
Emp. Form.C23H30ClN7O
Mol. Mass.455.984
SMILESCN(C)CC[C@H](NC(=O)C1(N)CCN(CC1)c1ncnc2[nH]ccc12)c1ccc(Cl)cc1