Reaction Details
TargetPotassium voltage-gated channel subfamily H member 2
LigandBDBM50427351
Substrate/Competitorn/a
Meas. Tech.ChEMBL_941078 (CHEMBL2330875)
IC50 57793±n/a nM
Citation Addie, MBallard, PButtar, DCrafter, CCurrie, GDavies, BRDebreczeni, JDry, HDudley, PGreenwood, RJohnson, PDKettle, JGLane, CLamont, GLeach, ALuke, RWMorris, JOgilvie, DPage, KPass, MPearson, SRuston, L Discovery of 4-amino-N-[(1S)-1-(4-chlorophenyl)-3-hydroxypropyl]-1-(7H-pyrrolo[2,3-d]pyrimidin-4-yl)piperidine-4-carboxamide (AZD5363), an orally bioavailable, potent inhibitor of Akt kinases. J Med Chem56:2059-73 (2013) 
 
Potassium voltage-gated channel subfamily H member 2
Name:Potassium voltage-gated channel subfamily H member 2
Type:Multi-pass membrane protein
Mol. Mass.:126672.65
Organism:Homo sapiens (Human)
Description:Q12809
Residue:1159
BDBM50427351
NameBDBM50427351
Synonyms:CHEMBL2325739 US11236095, Example 7 | US9492453, 7
TypeSmall organic molecule
Emp. Form.C22H27ClN6O2
Mol. Mass.442.942
SMILESNC1(CCN(CC1)c1ncnc2[nH]ccc12)C(=O)NC(CCCO)c1ccc(Cl)cc1