Reaction Details
TargetAmine oxidase [flavin-containing] A
LigandBDBM50427735
Substrate/Competitorn/a
Meas. Tech.ChEMBL_941905 (CHEMBL2329971)
IC50 12±n/a nM
Citation Pisani, LBarletta, MSoto-Otero, RNicolotti, OMendez-Alvarez, ECatto, MIntrocaso, AStefanachi, ACellamare, SAltomare, CCarotti, A Discovery, biological evaluation, and structure-activity and -selectivity relationships of 6'-substituted (E)-2-(benzofuran-3(2H)-ylidene)-N-methylacetamides, a novel class of potent and selective monoamine oxidase inhibitors. J Med Chem56:2651-64 (2013) 
 
Amine oxidase [flavin-containing] A
Name:Amine oxidase [flavin-containing] A
Type:Enzyme
Mol. Mass.:59515.21
Organism:Rattus norvegicus (rat)
Description:n/a
Residue:526
BDBM50427735
NameBDBM50427735
Synonyms:CHEMBL2324528
TypeSmall organic molecule
Emp. Form.C17H14ClNO5S
Mol. Mass.379.815
SMILESCNC(=O)\C=C1\COc2cc(OS(=O)(=O)c3ccc(Cl)cc3)ccc12