Reaction Details
TargetProtein arginine N-methyltransferase 3 [N508S]
LigandBDBM50427776
Substrate/Competitorn/a
Meas. Tech.ChEMBL_941988 (CHEMBL2330282)
IC50 1800±n/a nM
Citation Liu, FLi, FMa, ADobrovetsky, EDong, AGao, CKorboukh, ILiu, JSmil, DBrown, PJFrye, SVArrowsmith, CHSchapira, MVedadi, MJin, J Exploiting an allosteric binding site of PRMT3 yields potent and selective inhibitors. J Med Chem56:2110-24 (2013) 
 
Protein arginine N-methyltransferase 3 [N508S]
Name:Protein arginine N-methyltransferase 3 [N508S]
Type:Protein
Mol. Mass.:59859.85
Organism:Homo sapiens (Human)
Description:O60678[N508S]
Residue:531
BDBM50427776
NameBDBM50427776
Synonyms:CHEMBL2325179
TypeSmall organic molecule
Emp. Form.C15H11N5OS
Mol. Mass.309.346
SMILESO=C(NCc1ccc(cc1)C#N)Nc1ccc2nnsc2c1