Reaction Details
TargetProtein arginine N-methyltransferase 3 [N508S]
LigandBDBM50427786
Substrate/Competitorn/a
Meas. Tech.ChEMBL_941988 (CHEMBL2330282)
IC50>15000±n/a nM
Citation Liu, FLi, FMa, ADobrovetsky, EDong, AGao, CKorboukh, ILiu, JSmil, DBrown, PJFrye, SVArrowsmith, CHSchapira, MVedadi, MJin, J Exploiting an allosteric binding site of PRMT3 yields potent and selective inhibitors. J Med Chem56:2110-24 (2013) 
 
Protein arginine N-methyltransferase 3 [N508S]
Name:Protein arginine N-methyltransferase 3 [N508S]
Type:Protein
Mol. Mass.:59859.85
Organism:Homo sapiens (Human)
Description:O60678[N508S]
Residue:531
BDBM50427786
NameBDBM50427786
Synonyms:CHEMBL2325169
TypeSmall organic molecule
Emp. Form.C9H10N4OS
Mol. Mass.222.267
SMILESCCNC(=O)Nc1ccc2nnsc2c1