Reaction Details
TargetPotassium voltage-gated channel subfamily H member 2
LigandBDBM50427971
Substrate/Competitorn/a
Meas. Tech.ChEMBL_941020 (CHEMBL2330781)
IC50 15±n/a nM
Citation Carvalho, JFLouvel, JDoornbos, MLKlaasse, EYu, ZBrussee, JIJzerman, AP Strategies to reduce HERG K+ channel blockade. Exploring heteroaromaticity and rigidity in novel pyridine analogues of dofetilide. J Med Chem56:2828-40 (2013) 
 
Potassium voltage-gated channel subfamily H member 2
Name:Potassium voltage-gated channel subfamily H member 2
Type:Multi-pass membrane protein
Mol. Mass.:126672.65
Organism:Homo sapiens (Human)
Description:Q12809
Residue:1159
BDBM50427971
NameBDBM50427971
Synonyms:CHEMBL2325208
TypeSmall organic molecule
Emp. Form.C22H40N
Mol. Mass.318.5592
SMILESCCCCCCCCc1cccc(CCCCCCCC)[n+]1C