Reaction Details
TargetCannabinoid receptor 1
LigandBDBM50157304
Substrate/Competitorn/a
Meas. Tech.ChEMBL_943916 (CHEMBL2339883)
EC50>10000±n/a nM
Citation Rempel, VFuchs, AHinz, SKarcz, TLehr, MKoetter, UMüller, CE Magnolia Extract, Magnolol, and Metabolites: Activation of Cannabinoid CB2 Receptors and Blockade of the Related GPR55. ACS Med Chem Lett4:41-5 (2013) 
 
Cannabinoid receptor 1
Name:Cannabinoid receptor 1
Type:G Protein-Coupled Receptor (GPCR)
Mol. Mass.:52868.96
Organism:Homo sapiens (Human)
Description:P21554
Residue:472
BDBM50157304
NameBDBM50157304
Synonyms:3',5-di-2-propenyl-1,1'-biphenyl-2,4'-diol 5,3''-Diallyl-biphenyl-2,4''-diol CHEMBL16901 Honokiol, HO | cid_72303
TypeSmall organic molecule
Emp. Form.C18H18O2
Mol. Mass.266.3343
SMILESOc1ccc(cc1CC=C)-c1cc(CC=C)ccc1O