Reaction Details
TargetWD repeat-containing protein 5
LigandBDBM50428239
Substrate/Competitorn/a
Meas. Tech.ChEMBL_946433 (CHEMBL2339613)
Kd 1100±n/a nM
Citation Bolshan, YGetlik, MKuznetsova, EWasney, GAHajian, TPoda, GNguyen, KTWu, HDombrovski, LDong, ASenisterra, GSchapira, MArrowsmith, CHBrown, PJAl-Awar, RVedadi, MSmil, D Synthesis, Optimization, and Evaluation of Novel Small Molecules as Antagonists of WDR5-MLL Interaction. ACS Med Chem Lett4:353-7 (2013) 
 
WD repeat-containing protein 5
Name:WD repeat-containing protein 5
Type:Protein
Mol. Mass.:36597.13
Organism:Homo sapiens (Human)
Description:P61964
Residue:334
BDBM50428239
NameBDBM50428239
Synonyms:CHEMBL2337448
TypeSmall organic molecule
Emp. Form.C19H22N4O3
Mol. Mass.354.403
SMILESCN1CCN(CC1)c1ccc(cc1NC(=O)c1cccc(C)c1)[N+]([O-])=O