Reaction Details
TargetWD repeat-containing protein 5
LigandBDBM50428255
Substrate/Competitorn/a
Meas. Tech.ChEMBL_946434 (CHEMBL2339614)
IC50 6000±n/a nM
Citation Bolshan, YGetlik, MKuznetsova, EWasney, GAHajian, TPoda, GNguyen, KTWu, HDombrovski, LDong, ASenisterra, GSchapira, MArrowsmith, CHBrown, PJAl-Awar, RVedadi, MSmil, D Synthesis, Optimization, and Evaluation of Novel Small Molecules as Antagonists of WDR5-MLL Interaction. ACS Med Chem Lett4:353-7 (2013) 
 
WD repeat-containing protein 5
Name:WD repeat-containing protein 5
Type:Protein
Mol. Mass.:36597.13
Organism:Homo sapiens (Human)
Description:P61964
Residue:334
BDBM50428255
NameBDBM50428255
Synonyms:CHEMBL1231559
TypeSmall organic molecule
Emp. Form.C22H14O4
Mol. Mass.342.3442
SMILESOC(=O)c1ccc2ccccc2c1-c1c(ccc2ccccc12)C(O)=O