Reaction Details
TargetIntegrin alpha-4/beta-1
LigandBDBM50428679
Substrate/Competitorn/a
Meas. Tech.ChEMBL_946949 (CHEMBL2339198)
IC50 1.7±n/a nM
Citation Setoguchi, MIimura, SSugimoto, YYoneda, YChiba, JWatanabe, TMuro, FIigo, YTakayama, GYokoyama, MTaira, TAonuma, MTakashi, TNakayama, AMachinaga, N A novel, potent, and orally active VLA-4 antagonist with good aqueous solubility: trans-4-[1-[[2-(5-Fluoro-2-methylphenylamino)-7-fluoro-6-benzoxazolyl]acetyl]-(5S)-[methoxy(methyl)amino]methyl-(2S)-pyrrolidinylmethoxy]cyclohexanecarboxylic acid. Bioorg Med Chem21:42-61 (2012) 
 
Integrin alpha-4/beta-1
Name:Integrin alpha-4/beta-1
Type:n/a
Mol. Mass.:n/a
Description:ASSAY_ID of EBI is 88912
Components:This complex has 2 components.
Component 1
Name:Integrin beta-1
Synonyms:CD_antigen=CD29 Fibronectin receptor beta GPIIA ITGB1 MDF2 | MSK12
Type:Enzyme
Mol. Mass.:88400.38
Organism:Homo sapiens (Human)
Description:P05556
Residue:798
Component 2
Name:Integrin alpha-4
Synonyms:CD49 antigen-like family member D CD49d antigen ITA4_HUMAN Integrin alpha-4 Integrin alpha-IV VLA-4 integrin alpha 4 precursor | integrin alpha-4 precursor
Type:Membrane Protein
Mol. Mass.:114897.35
Organism:Homo sapiens (Human)
Description:P13612
Residue:1032
BDBM50428679
NameBDBM50428679
Synonyms:CHEMBL2332691
TypeSmall organic molecule
Emp. Form.C31H38FN3O6
Mol. Mass.567.6483
SMILESCCOC[C@@H]1CC[C@@H](CO[C@H]2CC[C@@H](CC2)C(O)=O)N1C(=O)Cc1ccc2nc(Nc3ccccc3C)oc2c1F