Reaction Details
TargetD(2) dopamine receptor
LigandBDBM50429067
Substrate/Competitorn/a
Meas. Tech.ChEMBL_943179 (CHEMBL2346210)
Ki 12±n/a nM
Citation Giovanni, ARoehr, JDwyer, SNeuenschwander, KScotese, AMoorcroft, NDDavis, LGao, Z Design and synthesis of D1 agonist/D2 antagonist for treatment of schizophrenia. Bioorg Med Chem Lett23:1498-501 (2013) 
 
D(2) dopamine receptor
Name:D(2) dopamine receptor
Type:Cell-surface receptors
Mol. Mass.:50647.10
Organism:Homo sapiens (Human)
Description:P14416
Residue:443
BDBM50429067
NameBDBM50429067
Synonyms:CHEMBL2335737
TypeSmall organic molecule
Emp. Form.C20H22ClNO2
Mol. Mass.343.847
SMILESCc1cc2CCN3CC[C@@](O)(C[C@@H]3c2cc1O)c1ccc(Cl)cc1