Reaction Details
TargetD(1A) dopamine receptor
LigandBDBM50429067
Substrate/Competitorn/a
Meas. Tech.ChEMBL_943180 (CHEMBL2346211)
Ki 5.5±n/a nM
Citation Giovanni, ARoehr, JDwyer, SNeuenschwander, KScotese, AMoorcroft, NDDavis, LGao, Z Design and synthesis of D1 agonist/D2 antagonist for treatment of schizophrenia. Bioorg Med Chem Lett23:1498-501 (2013) 
 
D(1A) dopamine receptor
Name:D(1A) dopamine receptor
Type:Enzyme
Mol. Mass.:49303.43
Organism:Homo sapiens (Human)
Description:P21728
Residue:446
BDBM50429067
NameBDBM50429067
Synonyms:CHEMBL2335737
TypeSmall organic molecule
Emp. Form.C20H22ClNO2
Mol. Mass.343.847
SMILESCc1cc2CCN3CC[C@@](O)(C[C@@H]3c2cc1O)c1ccc(Cl)cc1