Reaction Details
TargetP2Y purinoceptor 14
LigandBDBM50429538
Substrate/Competitorn/a
Meas. Tech.ChEMBL_945218 (CHEMBL2339544)
Ki 2350±n/a nM
Citation Chao, HTurdi, HHerpin, TFRoberge, JYLiu, YSchnur, DMPoss, MARehfuss, RHua, JWu, QPrice, LAAbell, LMSchumacher, WABostwick, JSSteinbacher, TEStewart, ABOgletree, MLHuang, CSChang, MCacace, AMArcuri, MJCelani, DWexler, RRLawrence, RM Discovery of 2-(phenoxypyridine)-3-phenylureas as small molecule P2Y1 antagonists. J Med Chem56:1704-14 (2013) 
 
P2Y purinoceptor 14
Name:P2Y purinoceptor 14
Type:PROTEIN
Mol. Mass.:38991.62
Organism:Homo sapiens (Human)
Description:ChEMBL_1502487
Residue:338
BDBM50429538
NameBDBM50429538
Synonyms:CHEMBL2333767
TypeSmall organic molecule
Emp. Form.C23H25N3OS
Mol. Mass.391.529
SMILESCc1ccc(NC(=O)Nc2cccnc2Sc2ccccc2C(C)(C)C)cc1