Reaction Details
TargetP2Y purinoceptor 6
LigandBDBM50429536
Substrate/Competitorn/a
Meas. Tech.ChEMBL_945220 (CHEMBL2339546)
Ki>15000±n/a nM
Citation Chao, HTurdi, HHerpin, TFRoberge, JYLiu, YSchnur, DMPoss, MARehfuss, RHua, JWu, QPrice, LAAbell, LMSchumacher, WABostwick, JSSteinbacher, TEStewart, ABOgletree, MLHuang, CSChang, MCacace, AMArcuri, MJCelani, DWexler, RRLawrence, RM Discovery of 2-(phenoxypyridine)-3-phenylureas as small molecule P2Y1 antagonists. J Med Chem56:1704-14 (2013) 
 
P2Y purinoceptor 6
Name:P2Y purinoceptor 6
Type:PROTEIN
Mol. Mass.:36452.29
Organism:Homo sapiens (Human)
Description:ChEMBL_1511151
Residue:328
BDBM50429536
NameBDBM50429536
Synonyms:CHEMBL2333771
TypeSmall organic molecule
Emp. Form.C26H31N3O2
Mol. Mass.417.5432
SMILESCC(C)(C)c1ccc(NC(=O)Nc2cccnc2Oc2ccccc2C(C)(C)C)cc1