Reaction Details
TargetP2Y purinoceptor 12
LigandBDBM50429535
Substrate/Competitorn/a
Meas. Tech.ChEMBL_945223 (CHEMBL2339549)
Ki>70000±n/a nM
Citation Chao, HTurdi, HHerpin, TFRoberge, JYLiu, YSchnur, DMPoss, MARehfuss, RHua, JWu, QPrice, LAAbell, LMSchumacher, WABostwick, JSSteinbacher, TEStewart, ABOgletree, MLHuang, CSChang, MCacace, AMArcuri, MJCelani, DWexler, RRLawrence, RM Discovery of 2-(phenoxypyridine)-3-phenylureas as small molecule P2Y1 antagonists. J Med Chem56:1704-14 (2013) 
 
P2Y purinoceptor 12
Name:P2Y purinoceptor 12
Type:Enzyme
Mol. Mass.:39458.48
Organism:Homo sapiens (Human)
Description:Q9H244
Residue:342
BDBM50429535
NameBDBM50429535
Synonyms:CHEMBL2333772
TypeSmall organic molecule
Emp. Form.C25H29N3O2
Mol. Mass.403.5167
SMILESCC(C)c1ccccc1Oc1ncccc1NC(=O)Nc1ccc(cc1)C(C)(C)C