Reaction Details
TargetP2Y purinoceptor 1
LigandBDBM50429542
Substrate/Competitorn/a
Meas. Tech.ChEMBL_945224 (CHEMBL2339550)
Ki>5000±n/a nM
Citation Chao, HTurdi, HHerpin, TFRoberge, JYLiu, YSchnur, DMPoss, MARehfuss, RHua, JWu, QPrice, LAAbell, LMSchumacher, WABostwick, JSSteinbacher, TEStewart, ABOgletree, MLHuang, CSChang, MCacace, AMArcuri, MJCelani, DWexler, RRLawrence, RM Discovery of 2-(phenoxypyridine)-3-phenylureas as small molecule P2Y1 antagonists. J Med Chem56:1704-14 (2013) 
 
P2Y purinoceptor 1
Name:P2Y purinoceptor 1
Type:Enzyme
Mol. Mass.:42090.25
Organism:Homo sapiens (Human)
Description:P47900
Residue:373
BDBM50429542
NameBDBM50429542
Synonyms:CHEMBL2333765
TypeSmall organic molecule
Emp. Form.C19H15F2N3O2
Mol. Mass.355.3381
SMILESCc1ccc(Oc2ncccc2NC(=O)Nc2ccc(F)cc2F)cc1