Reaction Details
TargetP2Y purinoceptor 1
LigandBDBM50429565
Substrate/Competitorn/a
Meas. Tech.ChEMBL_945224 (CHEMBL2339550)
Ki 607±n/a nM
Citation Chao, HTurdi, HHerpin, TFRoberge, JYLiu, YSchnur, DMPoss, MARehfuss, RHua, JWu, QPrice, LAAbell, LMSchumacher, WABostwick, JSSteinbacher, TEStewart, ABOgletree, MLHuang, CSChang, MCacace, AMArcuri, MJCelani, DWexler, RRLawrence, RM Discovery of 2-(phenoxypyridine)-3-phenylureas as small molecule P2Y1 antagonists. J Med Chem56:1704-14 (2013) 
 
P2Y purinoceptor 1
Name:P2Y purinoceptor 1
Type:Enzyme
Mol. Mass.:42090.25
Organism:Homo sapiens (Human)
Description:P47900
Residue:373
BDBM50429565
NameBDBM50429565
Synonyms:CHEMBL2333349
TypeSmall organic molecule
Emp. Form.C19H13F4N3O2
Mol. Mass.391.319
SMILESFc1cccc(NC(=O)Nc2cccnc2Oc2cccc(c2)C(F)(F)F)c1