Reaction Details
TargetA disintegrin and metalloproteinase with thrombospondin motifs 5
LigandBDBM50429815
Substrate/Competitorn/a
Meas. Tech.ChEMBL_948655 (CHEMBL2345605)
IC50 35±n/a nM
Citation Nuti, ESantamaria, SCasalini, FYamamoto, KMarinelli, LLa Pietra, VNovellino, EOrlandini, ENencetti, SMarini, AMSalerno, STaliani, SDa Settimo, FNagase, HRossello, A Arylsulfonamide inhibitors of aggrecanases as potential therapeutic agents for osteoarthritis: synthesis and biological evaluation. Eur J Med Chem62:379-94 (2013) 
 
A disintegrin and metalloproteinase with thrombospondin motifs 5
Name:A disintegrin and metalloproteinase with thrombospondin motifs 5
Type:Enzyme
Mol. Mass.:101769.09
Organism:Homo sapiens (Human)
Description:Q9UNA0
Residue:930
BDBM50429815
NameBDBM50429815
Synonyms:CHEMBL2337698
TypeSmall organic molecule
Emp. Form.C15H14ClFN2O5S
Mol. Mass.388.798
SMILESONC(=O)CNS(=O)(=O)c1ccc(OCc2ccc(F)cc2Cl)cc1