Reaction Details
TargetMatrix metalloproteinase-14
LigandBDBM50429816
Substrate/Competitorn/a
Meas. Tech.ChEMBL_948651 (CHEMBL2345601)
IC50 24±n/a nM
Citation Nuti, ESantamaria, SCasalini, FYamamoto, KMarinelli, LLa Pietra, VNovellino, EOrlandini, ENencetti, SMarini, AMSalerno, STaliani, SDa Settimo, FNagase, HRossello, A Arylsulfonamide inhibitors of aggrecanases as potential therapeutic agents for osteoarthritis: synthesis and biological evaluation. Eur J Med Chem62:379-94 (2013) 
 
Matrix metalloproteinase-14
Name:Matrix metalloproteinase-14
Type:Protein
Mol. Mass.:65900.19
Organism:Homo sapiens (Human)
Description:P50281
Residue:582
BDBM50429816
NameBDBM50429816
Synonyms:CHEMBL2337697
TypeSmall organic molecule
Emp. Form.C13H13N3O5S
Mol. Mass.323.324
SMILESONC(=O)CNS(=O)(=O)c1ccc(Oc2ccccc2)nc1