Reaction Details
TargetMatrix metalloproteinase-14
LigandBDBM50429818
Substrate/Competitorn/a
Meas. Tech.ChEMBL_948651 (CHEMBL2345601)
IC50 310±n/a nM
Citation Nuti, ESantamaria, SCasalini, FYamamoto, KMarinelli, LLa Pietra, VNovellino, EOrlandini, ENencetti, SMarini, AMSalerno, STaliani, SDa Settimo, FNagase, HRossello, A Arylsulfonamide inhibitors of aggrecanases as potential therapeutic agents for osteoarthritis: synthesis and biological evaluation. Eur J Med Chem62:379-94 (2013) 
 
Matrix metalloproteinase-14
Name:Matrix metalloproteinase-14
Type:Protein
Mol. Mass.:65900.19
Organism:Homo sapiens (Human)
Description:P50281
Residue:582
BDBM50429818
NameBDBM50429818
Synonyms:CHEMBL2337691
TypeSmall organic molecule
Emp. Form.C15H16N2O5S
Mol. Mass.336.363
SMILESONC(=O)CNS(=O)(=O)c1ccc(OCc2ccccc2)cc1