Reaction Details
TargetCollagenase 3
LigandBDBM50175535
Substrate/Competitorn/a
Meas. Tech.ChEMBL_948652 (CHEMBL2345602)
IC50 7.0±n/a nM
Citation Nuti, ESantamaria, SCasalini, FYamamoto, KMarinelli, LLa Pietra, VNovellino, EOrlandini, ENencetti, SMarini, AMSalerno, STaliani, SDa Settimo, FNagase, HRossello, A Arylsulfonamide inhibitors of aggrecanases as potential therapeutic agents for osteoarthritis: synthesis and biological evaluation. Eur J Med Chem62:379-94 (2013) 
 
Collagenase 3
Name:Collagenase 3
Type:Enzyme
Mol. Mass.:53808.06
Organism:Homo sapiens (Human)
Description:P45452
Residue:471
BDBM50175535
NameBDBM50175535
Synonyms:2-(4-Butoxy-benzenesulfonylamino)-N-hydroxy-acetamide | CHEMBL197842
TypeSmall organic molecule
Emp. Form.C12H18N2O5S
Mol. Mass.302.347
SMILESCCCCOc1ccc(cc1)S(=O)(=O)NCC(=O)NO