Reaction Details
TargetCollagenase 3
LigandBDBM50429816
Substrate/Competitorn/a
Meas. Tech.ChEMBL_948652 (CHEMBL2345602)
IC50 0.650000±n/a nM
Citation Nuti, ESantamaria, SCasalini, FYamamoto, KMarinelli, LLa Pietra, VNovellino, EOrlandini, ENencetti, SMarini, AMSalerno, STaliani, SDa Settimo, FNagase, HRossello, A Arylsulfonamide inhibitors of aggrecanases as potential therapeutic agents for osteoarthritis: synthesis and biological evaluation. Eur J Med Chem62:379-94 (2013) 
 
Collagenase 3
Name:Collagenase 3
Type:Enzyme
Mol. Mass.:53808.06
Organism:Homo sapiens (Human)
Description:P45452
Residue:471
BDBM50429816
NameBDBM50429816
Synonyms:CHEMBL2337697
TypeSmall organic molecule
Emp. Form.C13H13N3O5S
Mol. Mass.323.324
SMILESONC(=O)CNS(=O)(=O)c1ccc(Oc2ccccc2)nc1