Reaction Details
TargetCollagenase 3
LigandBDBM50429819
Substrate/Competitorn/a
Meas. Tech.ChEMBL_948652 (CHEMBL2345602)
IC50 1.5±n/a nM
Citation Nuti, ESantamaria, SCasalini, FYamamoto, KMarinelli, LLa Pietra, VNovellino, EOrlandini, ENencetti, SMarini, AMSalerno, STaliani, SDa Settimo, FNagase, HRossello, A Arylsulfonamide inhibitors of aggrecanases as potential therapeutic agents for osteoarthritis: synthesis and biological evaluation. Eur J Med Chem62:379-94 (2013) 
 
Collagenase 3
Name:Collagenase 3
Type:Enzyme
Mol. Mass.:53808.06
Organism:Homo sapiens (Human)
Description:P45452
Residue:471
BDBM50429819
NameBDBM50429819
Synonyms:CHEMBL2337690
TypeSmall organic molecule
Emp. Form.C19H24N2O5S
Mol. Mass.392.469
SMILESCC(C)CN(CC(=O)NO)S(=O)(=O)c1ccc(OCc2ccccc2)cc1