Reaction Details
Target72 kDa type IV collagenase
LigandBDBM50429816
Substrate/Competitorn/a
Meas. Tech.ChEMBL_948653 (CHEMBL2345603)
IC50 0.430000±n/a nM
Citation Nuti, ESantamaria, SCasalini, FYamamoto, KMarinelli, LLa Pietra, VNovellino, EOrlandini, ENencetti, SMarini, AMSalerno, STaliani, SDa Settimo, FNagase, HRossello, A Arylsulfonamide inhibitors of aggrecanases as potential therapeutic agents for osteoarthritis: synthesis and biological evaluation. Eur J Med Chem62:379-94 (2013) 
 
72 kDa type IV collagenase
Name:72 kDa type IV collagenase
Type:Enzyme
Mol. Mass.:73870.36
Organism:Homo sapiens (Human)
Description: P08253
Residue:660
BDBM50429816
NameBDBM50429816
Synonyms:CHEMBL2337697
TypeSmall organic molecule
Emp. Form.C13H13N3O5S
Mol. Mass.323.324
SMILESONC(=O)CNS(=O)(=O)c1ccc(Oc2ccccc2)nc1