Reaction Details
TargetInterstitial collagenase
LigandBDBM50175548
Substrate/Competitorn/a
Meas. Tech.ChEMBL_948654 (CHEMBL2345604)
IC50 720±n/a nM
Citation Nuti, ESantamaria, SCasalini, FYamamoto, KMarinelli, LLa Pietra, VNovellino, EOrlandini, ENencetti, SMarini, AMSalerno, STaliani, SDa Settimo, FNagase, HRossello, A Arylsulfonamide inhibitors of aggrecanases as potential therapeutic agents for osteoarthritis: synthesis and biological evaluation. Eur J Med Chem62:379-94 (2013) 
 
Interstitial collagenase
Name:Interstitial collagenase
Type:Enzyme
Mol. Mass.:54010.26
Organism:Homo sapiens (Human)
Description: P03956
Residue:469
BDBM50175548
NameBDBM50175548
Synonyms:CHEMBL198778 | N-Hydroxy-2-(4-phenoxy-benzenesulfonylamino)-acetamide
TypeSmall organic molecule
Emp. Form.C14H14N2O5S
Mol. Mass.322.336
SMILESONC(=O)CNS(=O)(=O)c1ccc(Oc2ccccc2)cc1