Reaction Details
TargetInterstitial collagenase
LigandBDBM50429817
Substrate/Competitorn/a
Meas. Tech.ChEMBL_948654 (CHEMBL2345604)
IC50>5000±n/a nM
Citation Nuti, ESantamaria, SCasalini, FYamamoto, KMarinelli, LLa Pietra, VNovellino, EOrlandini, ENencetti, SMarini, AMSalerno, STaliani, SDa Settimo, FNagase, HRossello, A Arylsulfonamide inhibitors of aggrecanases as potential therapeutic agents for osteoarthritis: synthesis and biological evaluation. Eur J Med Chem62:379-94 (2013) 
 
Interstitial collagenase
Name:Interstitial collagenase
Type:Enzyme
Mol. Mass.:54010.26
Organism:Homo sapiens (Human)
Description: P03956
Residue:469
BDBM50429817
NameBDBM50429817
Synonyms:CHEMBL2337696
TypeSmall organic molecule
Emp. Form.C15H16N2O5S
Mol. Mass.336.363
SMILESONC(=O)CCNS(=O)(=O)c1ccc(Oc2ccccc2)cc1