Reaction Details
TargetCannabinoid receptor 1
LigandBDBM50429834
Substrate/Competitorn/a
Meas. Tech.ChEMBL_949080 (CHEMBL2343733)
EC50>10000±n/a nM
Citation Nettekoven, MFingerle, JGrether, UGrüner, SKimbara, APüllmann, BRogers-Evans, MRöver, SSchuler, FSchulz-Gasch, TUllmer, C Highly potent and selective cannabinoid receptor 2 agonists: initial hit optimization of an adamantyl hit series identified from high-through-put screening. Bioorg Med Chem Lett23:1177-81 (2013) 
 
Cannabinoid receptor 1
Name:Cannabinoid receptor 1
Type:Enzyme
Mol. Mass.:52842.52
Organism:Mus musculus (Mouse)
Description:P47746
Residue:473
BDBM50429834
NameBDBM50429834
Synonyms:CHEMBL2338177
TypeSmall organic molecule
Emp. Form.C20H26N2O
Mol. Mass.310.4332
SMILESCN1CCN(C(=O)C23CC4CC(CC(C4)C2)C3)c2ccccc12