Reaction Details
TargetCannabinoid receptor 1
LigandBDBM50429828
Substrate/Competitorn/a
Meas. Tech.ChEMBL_949085 (CHEMBL2343738)
EC50>10000±n/a nM
Citation Nettekoven, MFingerle, JGrether, UGrüner, SKimbara, APüllmann, BRogers-Evans, MRöver, SSchuler, FSchulz-Gasch, TUllmer, C Highly potent and selective cannabinoid receptor 2 agonists: initial hit optimization of an adamantyl hit series identified from high-through-put screening. Bioorg Med Chem Lett23:1177-81 (2013) 
 
Cannabinoid receptor 1
Name:Cannabinoid receptor 1
Type:G Protein-Coupled Receptor (GPCR)
Mol. Mass.:52868.96
Organism:Homo sapiens (Human)
Description:P21554
Residue:472
BDBM50429828
NameBDBM50429828
Synonyms:CHEMBL2338184
TypeSmall organic molecule
Emp. Form.C20H22F3NO
Mol. Mass.349.39
SMILESFC(F)(F)c1ccc2CCN(C(=O)C34CC5CC(CC(C5)C3)C4)c2c1