Reaction Details
TargetCannabinoid receptor 1
LigandBDBM50429843
Substrate/Competitorn/a
Meas. Tech.ChEMBL_949085 (CHEMBL2343738)
EC50>10000±n/a nM
Citation Nettekoven, MFingerle, JGrether, UGrüner, SKimbara, APüllmann, BRogers-Evans, MRöver, SSchuler, FSchulz-Gasch, TUllmer, C Highly potent and selective cannabinoid receptor 2 agonists: initial hit optimization of an adamantyl hit series identified from high-through-put screening. Bioorg Med Chem Lett23:1177-81 (2013) 
 
Cannabinoid receptor 1
Name:Cannabinoid receptor 1
Type:G Protein-Coupled Receptor (GPCR)
Mol. Mass.:52868.96
Organism:Homo sapiens (Human)
Description:P21554
Residue:472
BDBM50429843
NameBDBM50429843
Synonyms:CHEMBL2338168
TypeSmall organic molecule
Emp. Form.C15H20N2OS
Mol. Mass.276.397
SMILESCc1csc(NC(=O)C23CC4CC(CC(C4)C2)C3)n1