Reaction Details
TargetCannabinoid receptor 2
LigandBDBM50429833
Substrate/Competitorn/a
Meas. Tech.ChEMBL_949086 (CHEMBL2343739)
EC50 220±n/a nM
Citation Nettekoven, MFingerle, JGrether, UGrüner, SKimbara, APüllmann, BRogers-Evans, MRöver, SSchuler, FSchulz-Gasch, TUllmer, C Highly potent and selective cannabinoid receptor 2 agonists: initial hit optimization of an adamantyl hit series identified from high-through-put screening. Bioorg Med Chem Lett23:1177-81 (2013) 
 
Cannabinoid receptor 2
Name:Cannabinoid receptor 2
Type:G Protein-Coupled Receptor (GPCR)
Mol. Mass.:39690.94
Organism:Homo sapiens (Human)
Description:P34972
Residue:360
BDBM50429833
NameBDBM50429833
Synonyms:CHEMBL2338178
TypeSmall organic molecule
Emp. Form.C19H23NO
Mol. Mass.281.392
SMILESO=C(N1CCc2ccccc12)C12CC3CC(CC(C3)C1)C2