Reaction Details
TargetCannabinoid receptor 2
LigandBDBM50429843
Substrate/Competitorn/a
Meas. Tech.ChEMBL_949086 (CHEMBL2343739)
EC50 900±n/a nM
Citation Nettekoven, MFingerle, JGrether, UGrüner, SKimbara, APüllmann, BRogers-Evans, MRöver, SSchuler, FSchulz-Gasch, TUllmer, C Highly potent and selective cannabinoid receptor 2 agonists: initial hit optimization of an adamantyl hit series identified from high-through-put screening. Bioorg Med Chem Lett23:1177-81 (2013) 
 
Cannabinoid receptor 2
Name:Cannabinoid receptor 2
Type:G Protein-Coupled Receptor (GPCR)
Mol. Mass.:39690.94
Organism:Homo sapiens (Human)
Description:P34972
Residue:360
BDBM50429843
NameBDBM50429843
Synonyms:CHEMBL2338168
TypeSmall organic molecule
Emp. Form.C15H20N2OS
Mol. Mass.276.397
SMILESCc1csc(NC(=O)C23CC4CC(CC(C4)C2)C3)n1