Reaction Details
TargetCannabinoid receptor 2
LigandBDBM50429824
Substrate/Competitorn/a
Meas. Tech.ChEMBL_949087 (CHEMBL2343740)
EC50 7.0±n/a nM
Citation Nettekoven, MFingerle, JGrether, UGrüner, SKimbara, APüllmann, BRogers-Evans, MRöver, SSchuler, FSchulz-Gasch, TUllmer, C Highly potent and selective cannabinoid receptor 2 agonists: initial hit optimization of an adamantyl hit series identified from high-through-put screening. Bioorg Med Chem Lett23:1177-81 (2013) 
 
Cannabinoid receptor 2
Name:Cannabinoid receptor 2
Type:G Protein-Coupled Receptor (GPCR)
Mol. Mass.:39690.94
Organism:Homo sapiens (Human)
Description:P34972
Residue:360
BDBM50429824
NameBDBM50429824
Synonyms:CHEMBL2338188
TypeSmall organic molecule
Emp. Form.C19H23NO
Mol. Mass.281.392
SMILESO=C(C1C2CC3CC(C2)CC1C3)N1CCc2ccccc12