Reaction Details
TargetCannabinoid receptor 2
LigandBDBM50429837
Substrate/Competitorn/a
Meas. Tech.ChEMBL_949081 (CHEMBL2343734)
Ki 5200±n/a nM
Citation Nettekoven, MFingerle, JGrether, UGrüner, SKimbara, APüllmann, BRogers-Evans, MRöver, SSchuler, FSchulz-Gasch, TUllmer, C Highly potent and selective cannabinoid receptor 2 agonists: initial hit optimization of an adamantyl hit series identified from high-through-put screening. Bioorg Med Chem Lett23:1177-81 (2013) 
 
Cannabinoid receptor 2
Name:Cannabinoid receptor 2
Type:Enzyme Catalytic Domain
Mol. Mass.:38220.43
Organism:MOUSE
Description:P47936
Residue:347
BDBM50429837
NameBDBM50429837
Synonyms:CHEMBL2338174
TypeSmall organic molecule
Emp. Form.C21H27NO2
Mol. Mass.325.4446
SMILESCOC1CCN(C(=O)C23CC4CC(CC(C4)C2)C3)c2ccccc12