Reaction Details
TargetCannabinoid receptor 2
LigandBDBM50429829
Substrate/Competitorn/a
Meas. Tech.ChEMBL_949084 (CHEMBL2343737)
EC50 9.0±n/a nM
Citation Nettekoven, MFingerle, JGrether, UGrüner, SKimbara, APüllmann, BRogers-Evans, MRöver, SSchuler, FSchulz-Gasch, TUllmer, C Highly potent and selective cannabinoid receptor 2 agonists: initial hit optimization of an adamantyl hit series identified from high-through-put screening. Bioorg Med Chem Lett23:1177-81 (2013) 
 
Cannabinoid receptor 2
Name:Cannabinoid receptor 2
Type:Enzyme Catalytic Domain
Mol. Mass.:38220.43
Organism:MOUSE
Description:P47936
Residue:347
BDBM50429829
NameBDBM50429829
Synonyms:CHEMBL2338183
TypeSmall organic molecule
Emp. Form.C19H22FNO
Mol. Mass.299.3825
SMILESFc1ccc2N(CCc2c1)C(=O)C12CC3CC(CC(C3)C1)C2