Reaction Details
TargetRetinoic acid receptor RXR-alpha
LigandBDBM50429863
Substrate/Competitorn/a
Meas. Tech.ChEMBL_942867 (CHEMBL2342375)
EC50 633±n/a nM
Citation Ohsawa, FYamada, SYakushiji, NShinozaki, RNakayama, MKawata, KHagaya, MKobayashi, TKohara, KFurusawa, YFujiwara, COhta, YMakishima, MNaitou, HTai, AYoshikawa, YYasui, HKakuta, H Mechanism of retinoid X receptor partial agonistic action of 1-(3,5,5,8,8-pentamethyl-5,6,7,8-tetrahydro-2-naphthyl)-1H-benzotriazole-5-carboxylic acid and structural development to increase potency. J Med Chem56:1865-77 (2013) 
 
Retinoic acid receptor RXR-alpha
Name:Retinoic acid receptor RXR-alpha
Type:PROTEIN
Mol. Mass.:50820.38
Organism:Homo sapiens (Human)
Description:ChEMBL_1456363
Residue:462
BDBM50429863
NameBDBM50429863
Synonyms:CHEMBL2332885
TypeSmall organic molecule
Emp. Form.C23H26N2O2
Mol. Mass.362.4647
SMILESCc1cc2c(cc1-n1cnc3cc(ccc13)C(O)=O)C(C)(C)CCC2(C)C