Reaction Details
TargetRetinoic acid receptor RXR-alpha
LigandBDBM50429864
Substrate/Competitorn/a
Meas. Tech.ChEMBL_942867 (CHEMBL2342375)
EC50 155±n/a nM
Citation Ohsawa, FYamada, SYakushiji, NShinozaki, RNakayama, MKawata, KHagaya, MKobayashi, TKohara, KFurusawa, YFujiwara, COhta, YMakishima, MNaitou, HTai, AYoshikawa, YYasui, HKakuta, H Mechanism of retinoid X receptor partial agonistic action of 1-(3,5,5,8,8-pentamethyl-5,6,7,8-tetrahydro-2-naphthyl)-1H-benzotriazole-5-carboxylic acid and structural development to increase potency. J Med Chem56:1865-77 (2013) 
 
Retinoic acid receptor RXR-alpha
Name:Retinoic acid receptor RXR-alpha
Type:PROTEIN
Mol. Mass.:50820.38
Organism:Homo sapiens (Human)
Description:ChEMBL_1456363
Residue:462
BDBM50429864
NameBDBM50429864
Synonyms:CHEMBL2332886
TypeSmall organic molecule
Emp. Form.C23H27N3O2
Mol. Mass.377.4794
SMILESCc1cc2c(cc1-n1c(N)nc3cc(ccc13)C(O)=O)C(C)(C)CCC2(C)C