Reaction Details
TargetAminopeptidase N
LigandBDBM50430636
Substrate/Competitorn/a
Meas. Tech.ChEMBL_942091 (CHEMBL2340789)
IC50 93±n/a nM
Citation Ma, CJin, KCao, JZhang, LLi, XXu, W Novel leucine ureido derivatives as inhibitors of aminopeptidase N (APN). Bioorg Med Chem21:1621-7 (2013) 
 
Aminopeptidase N
Name:Aminopeptidase N
Type:Protein
Mol. Mass.:108810.25
Organism:Sus scrofa (Pig)
Description:P15145
Residue:963
BDBM50430636
NameBDBM50430636
Synonyms:CHEMBL2332524
TypeSmall organic molecule
Emp. Form.C13H18ClN3O3
Mol. Mass.299.753
SMILESCC(C)C[C@H](NC(=O)Nc1ccccc1Cl)C(=O)NO