Reaction Details
TargetProteasome subunit beta type-1
LigandBDBM50069985
Substrate/Competitorn/a
Meas. Tech.ChEMBL_946846 (CHEMBL2345511)
IC50 600±n/a nM
Citation Desvergne, AGenin, EMaréchal, XGallastegui, NDufau, LRichy, NGroll, MVidal, JReboud-Ravaux, M Dimerized linear mimics of a natural cyclopeptide (TMC-95A) are potent noncovalent inhibitors of the eukaryotic 20S proteasome. J Med Chem56:3367-78 (2013) 
 
Proteasome subunit beta type-1
Name:Proteasome subunit beta type-1
Type:PROTEIN
Mol. Mass.:26493.62
Organism:Homo sapiens (Human)
Description:ChEMBL_1366691
Residue:241
BDBM50069985
NameBDBM50069985
Synonyms:(S)-4-methyl-2-(3-phenyl-propionylamino)-pentanoic acid [(S)-1-((S)-1-formyl-3-methyl-butylcarbamoyl)-3-methyl-butyl]-amide Cbz-L-leu-L-leu-L-leu-CHO MG-132 Z-Leu-Leu-Leu-H benzyl (S)-4-methyl-1-((S)-4-methyl-1-((S)-4-methyl-1-oxopentan-2-ylamino)-1-oxopentan-2-ylamino)-1-oxopentan-2-ylcarbamate benzyloxycarbonyl-Leu-Leu-leucinal {1-[(S)-(S)-1-((S)-1-Formyl-3-methyl-butylcarbamoyl)-3-methyl-butylcarbamoyl]-3-methyl-butyl}-carbamic acid benzyl ester | {1-[1-(1-Formyl-3-methyl-butylcarbamoyl)-3-methyl-butylcarbamoyl]-3-methyl-butyl}-carbamic acid benzyl ester
TypeSmall organic molecule
Emp. Form.C26H41N3O5
Mol. Mass.475.6208
SMILESCC(C)C[C@H](NC(=O)[C@H](CC(C)C)NC(=O)[C@H](CC(C)C)NC(=O)OCc1ccccc1)C=O