Reaction Details
TargetProteasome subunit beta type-5
LigandBDBM50430963
Substrate/Competitorn/a
Meas. Tech.ChEMBL_946852 (CHEMBL2345517)
Ki 67±n/a nM
Citation Desvergne, AGenin, EMaréchal, XGallastegui, NDufau, LRichy, NGroll, MVidal, JReboud-Ravaux, M Dimerized linear mimics of a natural cyclopeptide (TMC-95A) are potent noncovalent inhibitors of the eukaryotic 20S proteasome. J Med Chem56:3367-78 (2013) 
 
Proteasome subunit beta type-5
Name:Proteasome subunit beta type-5
Type:Protein
Mol. Mass.:28480.96
Organism:Homo sapiens (Human)
Description:n/a
Residue:263
BDBM50430963
NameBDBM50430963
Synonyms:CHEMBL2337842
TypeSmall organic molecule
Emp. Form.C66H91N9O12
Mol. Mass.1202.4818
SMILESC[C@H](NC(=O)[C@H](Cc1ccc(OCc2ccccc2)cc1)NC(=O)CCCCCNC(=O)CCCCCNC(=O)CCCCCNC(=O)CCCCCNC(=O)OC(C)(C)C)C(=O)N[C@@H](C[C@]1(O)C(=O)Nc2ccccc12)C(=O)NCc1ccccc1