Reaction Details
TargetAcid ceramidase
LigandBDBM50431265
Substrate/Competitorn/a
Meas. Tech.ChEMBL_949261 (CHEMBL2346137)
IC50 1400±n/a nM
Citation Pizzirani, DPagliuca, CRealini, NBranduardi, DBottegoni, GMor, MBertozzi, FScarpelli, RPiomelli, DBandiera, T Discovery of a new class of highly potent inhibitors of acid ceramidase: synthesis and structure-activity relationship (SAR). J Med Chem56:3518-30 (2013) 
 
Acid ceramidase
Name:Acid ceramidase
Type:Enzyme
Mol. Mass.:44450.22
Organism:Rattus norvegicus (Rat)
Description:Q6P7S1
Residue:394
BDBM50431265
NameBDBM50431265
Synonyms:CHEMBL2333039 | US9428465, 13
TypeSmall organic molecule
Emp. Form.C16H27N5O3
Mol. Mass.337.4173
SMILESCCCCCCNC(=O)n1cc(N2CCN(C)CC2)c(=O)[nH]c1=O