Reaction Details
TargetAcid ceramidase
LigandBDBM50431273
Substrate/Competitorn/a
Meas. Tech.ChEMBL_949261 (CHEMBL2346137)
IC50 1460±n/a nM
Citation Pizzirani, DPagliuca, CRealini, NBranduardi, DBottegoni, GMor, MBertozzi, FScarpelli, RPiomelli, DBandiera, T Discovery of a new class of highly potent inhibitors of acid ceramidase: synthesis and structure-activity relationship (SAR). J Med Chem56:3518-30 (2013) 
 
Acid ceramidase
Name:Acid ceramidase
Type:Enzyme
Mol. Mass.:44450.22
Organism:Rattus norvegicus (Rat)
Description:Q6P7S1
Residue:394
BDBM50431273
NameBDBM50431273
Synonyms:CHEMBL2333031
TypeSmall organic molecule
Emp. Form.C12H19N3O3
Mol. Mass.253.2976
SMILESCCCCCCNC(=O)n1cc(C)c(=O)[nH]c1=O