Reaction Details
TargetDipeptidyl peptidase 4
LigandBDBM50431781
Substrate/Competitorn/a
Meas. Tech.ChEMBL_951849 (CHEMBL2353262)
IC50 212±n/a nM
Citation Zeng, SXie, HZeng, LLLu, XZhao, XZhang, GCTu, ZCXu, HJYang, LZhang, XQHu, W Discovery of potent dipeptidyl peptidase IV inhibitors through pharmacophore hybridization and hit-to-lead optimization. Bioorg Med Chem21:1749-55 (2013) 
 
Dipeptidyl peptidase 4
Name:Dipeptidyl peptidase 4
Type:Enzyme
Mol. Mass.:88271.01
Organism:Homo sapiens (Human)
Description:P27487
Residue:766
BDBM50431781
NameBDBM50431781
Synonyms:CHEMBL2346919
TypeSmall organic molecule
Emp. Form.C16H21N5O
Mol. Mass.299.3708
SMILESCC#CCn1c(nc2ccn(C)c2c1=O)N1CCC[C@@H](N)C1