Reaction Details
TargetDipeptidyl peptidase 4
LigandBDBM50431785
Substrate/Competitorn/a
Meas. Tech.ChEMBL_951849 (CHEMBL2353262)
IC50 4.7±n/a nM
Citation Zeng, SXie, HZeng, LLLu, XZhao, XZhang, GCTu, ZCXu, HJYang, LZhang, XQHu, W Discovery of potent dipeptidyl peptidase IV inhibitors through pharmacophore hybridization and hit-to-lead optimization. Bioorg Med Chem21:1749-55 (2013) 
 
Dipeptidyl peptidase 4
Name:Dipeptidyl peptidase 4
Type:Enzyme
Mol. Mass.:88271.01
Organism:Homo sapiens (Human)
Description:P27487
Residue:766
BDBM50431785
NameBDBM50431785
Synonyms:CHEMBL2347036
TypeSmall organic molecule
Emp. Form.C25H25FN6O
Mol. Mass.444.504
SMILESCC#CCn1c(nc2ccn(Cc3ccc4ccc(F)cc4n3)c2c1=O)N1CCC[C@@H](N)C1