Reaction Details
TargetDipeptidyl peptidase 4
LigandBDBM50431790
Substrate/Competitorn/a
Meas. Tech.ChEMBL_951849 (CHEMBL2353262)
IC50 139±n/a nM
Citation Zeng, SXie, HZeng, LLLu, XZhao, XZhang, GCTu, ZCXu, HJYang, LZhang, XQHu, W Discovery of potent dipeptidyl peptidase IV inhibitors through pharmacophore hybridization and hit-to-lead optimization. Bioorg Med Chem21:1749-55 (2013) 
 
Dipeptidyl peptidase 4
Name:Dipeptidyl peptidase 4
Type:Enzyme
Mol. Mass.:88271.01
Organism:Homo sapiens (Human)
Description:P27487
Residue:766
BDBM50431790
NameBDBM50431790
Synonyms:CHEMBL2346927
TypeSmall organic molecule
Emp. Form.C25H25BrN6O
Mol. Mass.505.41
SMILESCC#CCn1c(nc2ccn(Cc3ccc4cc(Br)ccc4n3)c2c1=O)N1CCC[C@@H](N)C1